{"text_format":"1","workbook":"xlsx","n_sheets":4,"sheets":["Sheet1","Sheet2","Sheet3","Sheet4"],"not_rendered":{"charts":1,"images":11,"macros":1,"external_links":0,"defined_names":0,"comments":0,"pivot_tables":0},"unopened":[],"bounds":{"document_bytes":16777216,"sheet_cells":100000,"rows_first":2000,"rows_last":500,"rows_between":2000,"halvings":0,"cell_chars":16384,"cell_head_chars":4096},"cells_cut":0,"cells_raw":0,"read":"whole","date_system":"1900"}

{"sheet":"Sheet1","index":0,"n_rows":16,"n_cols":3,"rows_kept":16,"cut":false,"hidden":false,"merged":[]}
[null,"Variable","Value"]
[null,"Length of the Room (m)",4]
[null,"Width of the Room (m)",5]
[null,"Height of the Room (ignoring the roof) (m)",5]
[null,"Height of the Roof (m)",0]
[null,"Distance Between the Floor and the Base of the Fire (m)",0]
[null,"Ambient Temperature of the Room",293]
[null,"Ambient Pressure of the Room (kg/m^3)",1.18]
[null,"Specific Heat Constant",1.004]
[null,"K",7.5999999999999998E-2]
[null,"Time Step (s)",2]
[null,"End Time (s)",6000]
[null,"Fraction of Heat Radiated from the Fire",0.35]
[null,"Lump Amount of Energy Lost",0.6]
[null,"Height of Subject (m)",1.75]
[null,"Concentration of Carbon Monoxide (ppm)",10000]

{"sheet":"Sheet2","index":1,"n_rows":3003,"n_cols":13,"rows_kept":3003,"cut":false,"hidden":false,"merged":[]}
[]
[null,"t","Qdot","mH","dH","eH","z","tH","COHb%","FICO"]
[null,0,0.1,0,0,0,5,293,0,0,null,"Notation","Definition"]
[null,2,4.0999999999999996,0.44675359066694398,1.8935998539779137E-2,131.46239727367623,4.9810640014602212,293.08917810238682,6.4181959935688503E-3,2.1393986645229502E-2,null,"t","Time"]
[null,4,8.1,1.9775456476003708,8.4036296280415493E-2,583.41855824589629,4.9159637037195845,293.84615329862999,1.2836391987137701E-2,4.2787973290459004E-2,null,"Qdot","Total Rate of Energy Supplied by the Fire"]
[null,6,12.1,3.8566929733079176,0.16412787637901233,1139.4510853439367,4.8358721236209874,294.27062186186197,1.9254587980706551E-2,6.418195993568851E-2,null,"mH","Mass of the Hot Layer"]
[null,8,16.100000000000001,5.9468127835835691,0.25338943442006051,1759.1458101723456,4.7466105655799398,294.63467657241273,2.5672783974275401E-2,8.5575946580918008E-2,null,"dH","Depth of the Hot Layer"]
[null,10,20.100000000000001,8.1754155870910488,0.34874938178761611,2421.1783540857477,4.6512506182123836,294.97365601729268,3.2090979967844248E-2,0.10696993322614751,null,"eH","Enthalpy in the Hot Layer"]
[null,12,24.1,10.495299739863079,0.44820764882204878,3111.6633150750013,4.5517923511779514,295.30040369434323,3.8509175961413102E-2,0.12836391987137702,null,"z","Height of the Fire"]
[null,14,28.1,12.872657059005736,0.55033168540073463,3820.6552723618352,4.4496683145992657,295.62144946188175,4.4927371954981948E-2,0.1497579065166065,null,"tH","Temperature of the Hot Layer"]
[null,16,32.1,15.282005152562347,0.65404172915262804,4540.6580197395706,4.3459582708473716,295.94072921682596,5.1345567948550802E-2,0.17115189316183602,null,"COHb %","Concentration of CO in the Blood"]
[null,18,36.1,17.703567425968064,0.75849978878260849,5265.8538368318768,4.2415002112173914,296.26087292331033,5.7763763942119649E-2,0.1925458798070655,null,"FICO","Fraction of Incapacitating Dose"]
[null,20,40.1,20.121734295405886,0.86304444124758273,5991.6508211481396,4.1369555587524172,296.58376433791415,6.4181959935688496E-2,0.21393986645229501,null,null,"The Subject is Within the Hot Layer"]
[null,22,44.1,22.524073126478882,0.96714888000530774,6714.3916397625444,4.0328511199946924,296.91082238579821,7.0600155929257349E-2,0.2353338530975245,null,null,"The subject has died to to this value"]
[null,24,48.1,24.900646480550609,1.0703920271474598,7431.1529764765319,3.9296079728525402,297.2431577268668,7.7018351922826203E-2,0.25672783974275404]
[null,26,52.1,27.243517860104372,1.1724375904063826,8139.6001359426218,3.8275624095936172,297.58166664717925,8.3436547916395057E-2,0.2781218263879835]
[null,28,56.1,29.546379011836834,1.2730182709132905,8837.8774066700644,3.7269817290867095,297.92709069983522,8.9854743909963897E-2,0.29951581303321301]
[null,30,60.1,31.804260299882426,1.3719234908772693,9524.5228609370133,3.6280765091227307,298.28005635940576,9.627293990353275E-2,0.32090979967844252]
[null,32,64.099999999999994,34.013300385320953,1.4689896342423787,10198.400600950636,3.5310103657576213,298.64110238602325,0.1026911358971016,0.34230378632367203]
[null,34,68.099999999999994,36.170559810694492,1.5640921477265031,10858.645920631619,3.4359078522734969,299.01069930085669,0.10910933189067044,0.36369777296890149]
[null,36,72.099999999999994,38.273868075643122,1.6571390609754089,11504.620319548087,3.3428609390245909,299.38926361417185,0.1155275278842393,0.385091759614131]
[null,38,76.099999999999994,40.321696893990591,1.7480656161002717,12135.874218698998,3.2519343838997283,299.77716845571649,0.12194572387780815,0.40648574625936051]
[null,40,80.099999999999994,42.313054329876351,1.8368297819205599,12752.115818328384,3.1631702180794403,300.17475167364984,0.12836391987137699,0.42787973290459003]
[null,42,84.1,44.247395854227491,1.9234084851704722,13353.184933229808,3.076591514829528,300.5823221116429,0.13478211586494585,0.44927371954981954]
[null,44,88.1,46.124549291367863,2.0077944302705109,13939.030914140265,2.9922055697294891,301.00016454866045,0.1412003118585147,0.470667706195049]
[null,46,92.1,47.944651286151107,2.0899934072568467,14509.693958149641,2.9100065927431533,301.42854363973845,0.14761850785208355,0.49206169284027851]
[null,48,96.1,49.708093404705167,2.1700220079145627,15065.289253048926,2.8299779920854373,301.86770709872525,0.15403670384565241,0.51345567948550808]
[null,50,100.1,51.415476343252969,2.2479056854734432,15605.99350684741,2.7520943145265568,302.31788829768396,0.16045489983922126,0.53484966613073748]
[null,52,104.1,53.067570995982202,2.3236771049414413,16132.033495030073,2.6763228950585587,302.77930841163965,0.16687309583279011,0.55624365277596699]
[null,54,108.1,54.665285348636978,2.3973747402907657,16643.676321579234,2.6026252597092343,303.25217820482709,0.17329129182635897,0.5776376394211965]
{"$rows_left_out":2974}
{"sheet":"Sheet3","index":2,"n_rows":33,"n_cols":11,"rows_kept":33,"cut":false,"hidden":false,"merged":[]}
[]
[null,"i","t","Qdot","mH","dH","eH","z","tH","COHb","FICO"]
[null,0,{"$f":"B3*Sheet1!$C$11","v":0},{"$f":"VLOOKUP(Sheet3!C3,Sheet2!B3:J3003,2,FALSE)","v":0.1},{"$f":"VLOOKUP(Sheet3!C3,Sheet2!B3:J3003,3,FALSE)","v":0},{"$f":"VLOOKUP(Sheet3!C3,Sheet2!B3:J3003,4,FALSE)","v":0},{"$f":"VLOOKUP(Sheet3!C3,Sheet2!B3:J3003,5,FALSE)","v":0},{"$f":"VLOOKUP(Sheet3!C3,Sheet2!B3:J3003,6,FALSE)","v":5},{"$f":"VLOOKUP(Sheet3!C3,Sheet2!B3:J3003,7,FALSE)","v":293},{"$f":"VLOOKUP(Sheet3!C3,Sheet2!B3:J3003,8,FALSE)","v":0},{"$f":"VLOOKUP(Sheet3!C3,Sheet2!B3:J3003,9,FALSE)","v":0}]
[null,{"$f":"B3+1","v":1},{"$f":"B4*Sheet1!$C$11","v":2},{"$f":"VLOOKUP(Sheet3!C4,Sheet2!B3:J3003,2,FALSE)","v":4.0999999999999996},{"$f":"VLOOKUP(Sheet3!C4,Sheet2!B3:J3003,3,FALSE)","v":0.44675359066694398},{"$f":"VLOOKUP(Sheet3!C4,Sheet2!B3:J3003,4,FALSE)","v":1.8935998539779137E-2},{"$f":"VLOOKUP(Sheet3!C4,Sheet2!B3:J3003,5,FALSE)","v":131.46239727367623},{"$f":"VLOOKUP(Sheet3!C4,Sheet2!B3:J3003,6,FALSE)","v":4.9810640014602212},{"$f":"VLOOKUP(Sheet3!C4,Sheet2!B3:J3003,7,FALSE)","v":293.08917810238682},{"$f":"VLOOKUP(Sheet3!C4,Sheet2!B3:J3003,8,FALSE)","v":6.4181959935688503E-3},{"$f":"VLOOKUP(Sheet3!C4,Sheet2!B3:J3003,9,FALSE)","v":2.1393986645229502E-2}]
[null,{"$f":"B4+1","v":2},{"$f":"B5*Sheet1!$C$11","v":4},{"$f":"VLOOKUP(Sheet3!C5,Sheet2!B3:J3003,2,FALSE)","v":8.1},{"$f":"VLOOKUP(Sheet3!C5,Sheet2!B3:J3003,3,FALSE)","v":1.9775456476003708},{"$f":"VLOOKUP(Sheet3!C5,Sheet2!B3:J3003,4,FALSE)","v":8.4036296280415493E-2},{"$f":"VLOOKUP(Sheet3!C5,Sheet2!B3:J3003,5,FALSE)","v":583.41855824589629},{"$f":"VLOOKUP(Sheet3!C5,Sheet2!B3:J3003,6,FALSE)","v":4.9159637037195845},{"$f":"VLOOKUP(Sheet3!C5,Sheet2!B3:J3003,7,FALSE)","v":293.84615329862999},{"$f":"VLOOKUP(Sheet3!C5,Sheet2!B3:J3003,8,FALSE)","v":1.2836391987137701E-2},{"$f":"VLOOKUP(Sheet3!C5,Sheet2!B3:J3003,9,FALSE)","v":4.2787973290459004E-2}]
[null,3,{"$f":"B6*Sheet1!$C$11","v":6},{"$f":"VLOOKUP(Sheet3!C6,Sheet2!B3:J3003,2,FALSE)","v":12.1},{"$f":"VLOOKUP(Sheet3!C6,Sheet2!B3:J3003,3,FALSE)","v":3.8566929733079176},{"$f":"VLOOKUP(Sheet3!C6,Sheet2!B3:J3003,4,FALSE)","v":0.16412787637901233},{"$f":"VLOOKUP(Sheet3!C6,Sheet2!B3:J3003,5,FALSE)","v":1139.4510853439367},{"$f":"VLOOKUP(Sheet3!C6,Sheet2!B3:J3003,6,FALSE)","v":4.8358721236209874},{"$f":"VLOOKUP(Sheet3!C6,Sheet2!B3:J3003,7,FALSE)","v":294.27062186186197},{"$f":"VLOOKUP(Sheet3!C6,Sheet2!B3:J3003,8,FALSE)","v":1.9254587980706551E-2},{"$f":"VLOOKUP(Sheet3!C6,Sheet2!B3:J3003,9,FALSE)","v":6.418195993568851E-2}]
[null,4,{"$f":"B7*Sheet1!$C$11","v":8},{"$f":"VLOOKUP(Sheet3!C7,Sheet2!B3:J3003,2,FALSE)","v":16.100000000000001},{"$f":"VLOOKUP(Sheet3!C7,Sheet2!B3:J3003,3,FALSE)","v":5.9468127835835691},{"$f":"VLOOKUP(Sheet3!C7,Sheet2!B3:J3003,4,FALSE)","v":0.25338943442006051},{"$f":"VLOOKUP(Sheet3!C7,Sheet2!B3:J3003,5,FALSE)","v":1759.1458101723456},{"$f":"VLOOKUP(Sheet3!C7,Sheet2!B3:J3003,6,FALSE)","v":4.7466105655799398},{"$f":"VLOOKUP(Sheet3!C7,Sheet2!B3:J3003,7,FALSE)","v":294.63467657241273},{"$f":"VLOOKUP(Sheet3!C7,Sheet2!B3:J3003,8,FALSE)","v":2.5672783974275401E-2},{"$f":"VLOOKUP(Sheet3!C7,Sheet2!B3:J3003,9,FALSE)","v":8.5575946580918008E-2}]
[null,5,{"$f":"B8*Sheet1!$C$11","v":10},{"$f":"VLOOKUP(Sheet3!C8,Sheet2!B3:J3003,2,FALSE)","v":20.100000000000001},{"$f":"VLOOKUP(Sheet3!C8,Sheet2!B3:J3003,3,FALSE)","v":8.1754155870910488},{"$f":"VLOOKUP(Sheet3!C8,Sheet2!B3:J3003,4,FALSE)","v":0.34874938178761611},{"$f":"VLOOKUP(Sheet3!C8,Sheet2!B3:J3003,5,FALSE)","v":2421.1783540857477},{"$f":"VLOOKUP(Sheet3!C8,Sheet2!B3:J3003,6,FALSE)","v":4.6512506182123836},{"$f":"VLOOKUP(Sheet3!C8,Sheet2!B3:J3003,7,FALSE)","v":294.97365601729268},{"$f":"VLOOKUP(Sheet3!C8,Sheet2!B3:J3003,8,FALSE)","v":3.2090979967844248E-2},{"$f":"VLOOKUP(Sheet3!C8,Sheet2!B3:J3003,9,FALSE)","v":0.10696993322614751}]
[null,6,{"$f":"B9*Sheet1!$C$11","v":12},{"$f":"VLOOKUP(Sheet3!C9,Sheet2!B3:J3003,2,FALSE)","v":24.1},{"$f":"VLOOKUP(Sheet3!C9,Sheet2!B3:J3003,3,FALSE)","v":10.495299739863079},{"$f":"VLOOKUP(Sheet3!C9,Sheet2!B3:J3003,4,FALSE)","v":0.44820764882204878},{"$f":"VLOOKUP(Sheet3!C9,Sheet2!B3:J3003,5,FALSE)","v":3111.6633150750013},{"$f":"VLOOKUP(Sheet3!C9,Sheet2!B3:J3003,6,FALSE)","v":4.5517923511779514},{"$f":"VLOOKUP(Sheet3!C9,Sheet2!B3:J3003,7,FALSE)","v":295.30040369434323},{"$f":"VLOOKUP(Sheet3!C9,Sheet2!B3:J3003,8,FALSE)","v":3.8509175961413102E-2},{"$f":"VLOOKUP(Sheet3!C9,Sheet2!B3:J3003,9,FALSE)","v":0.12836391987137702}]
[null,7,{"$f":"B10*Sheet1!$C$11","v":14},{"$f":"VLOOKUP(Sheet3!C10,Sheet2!B3:J3003,2,FALSE)","v":28.1},{"$f":"VLOOKUP(Sheet3!C10,Sheet2!B3:J3003,3,FALSE)","v":12.872657059005736},{"$f":"VLOOKUP(Sheet3!C10,Sheet2!B3:J3003,4,FALSE)","v":0.55033168540073463},{"$f":"VLOOKUP(Sheet3!C10,Sheet2!B3:J3003,5,FALSE)","v":3820.6552723618352},{"$f":"VLOOKUP(Sheet3!C10,Sheet2!B3:J3003,6,FALSE)","v":4.4496683145992657},{"$f":"VLOOKUP(Sheet3!C10,Sheet2!B3:J3003,7,FALSE)","v":295.62144946188175},{"$f":"VLOOKUP(Sheet3!C10,Sheet2!B3:J3003,8,FALSE)","v":4.4927371954981948E-2},{"$f":"VLOOKUP(Sheet3!C10,Sheet2!B3:J3003,9,FALSE)","v":0.1497579065166065}]
[null,8,{"$f":"B11*Sheet1!$C$11","v":16},{"$f":"VLOOKUP(Sheet3!C11,Sheet2!B3:J3003,2,FALSE)","v":32.1},{"$f":"VLOOKUP(Sheet3!C11,Sheet2!B3:J3003,3,FALSE)","v":15.282005152562347},{"$f":"VLOOKUP(Sheet3!C11,Sheet2!B3:J3003,4,FALSE)","v":0.65404172915262804},{"$f":"VLOOKUP(Sheet3!C11,Sheet2!B3:J3003,5,FALSE)","v":4540.6580197395706},{"$f":"VLOOKUP(Sheet3!C11,Sheet2!B3:J3003,6,FALSE)","v":4.3459582708473716},{"$f":"VLOOKUP(Sheet3!C11,Sheet2!B3:J3003,7,FALSE)","v":295.94072921682596},{"$f":"VLOOKUP(Sheet3!C11,Sheet2!B3:J3003,8,FALSE)","v":5.1345567948550802E-2},{"$f":"VLOOKUP(Sheet3!C11,Sheet2!B3:J3003,9,FALSE)","v":0.17115189316183602}]
[null,9,{"$f":"B12*Sheet1!$C$11","v":18},{"$f":"VLOOKUP(Sheet3!C12,Sheet2!B3:J3003,2,FALSE)","v":36.1},{"$f":"VLOOKUP(Sheet3!C12,Sheet2!B3:J3003,3,FALSE)","v":17.703567425968064},{"$f":"VLOOKUP(Sheet3!C12,Sheet2!B3:J3003,4,FALSE)","v":0.75849978878260849},{"$f":"VLOOKUP(Sheet3!C12,Sheet2!B3:J3003,5,FALSE)","v":5265.8538368318768},{"$f":"VLOOKUP(Sheet3!C12,Sheet2!B3:J3003,6,FALSE)","v":4.2415002112173914},{"$f":"VLOOKUP(Sheet3!C12,Sheet2!B3:J3003,7,FALSE)","v":296.26087292331033},{"$f":"VLOOKUP(Sheet3!C12,Sheet2!B3:J3003,8,FALSE)","v":5.7763763942119649E-2},{"$f":"VLOOKUP(Sheet3!C12,Sheet2!B3:J3003,9,FALSE)","v":0.1925458798070655}]
[null,10,{"$f":"B13*Sheet1!$C$11","v":20},{"$f":"VLOOKUP(Sheet3!C13,Sheet2!B3:J3003,2,FALSE)","v":40.1},{"$f":"VLOOKUP(Sheet3!C13,Sheet2!B3:J3003,3,FALSE)","v":20.121734295405886},{"$f":"VLOOKUP(Sheet3!C13,Sheet2!B3:J3003,4,FALSE)","v":0.86304444124758273},{"$f":"VLOOKUP(Sheet3!C13,Sheet2!B3:J3003,5,FALSE)","v":5991.6508211481396},{"$f":"VLOOKUP(Sheet3!C13,Sheet2!B3:J3003,6,FALSE)","v":4.1369555587524172},{"$f":"VLOOKUP(Sheet3!C13,Sheet2!B3:J3003,7,FALSE)","v":296.58376433791415},{"$f":"VLOOKUP(Sheet3!C13,Sheet2!B3:J3003,8,FALSE)","v":6.4181959935688496E-2},{"$f":"VLOOKUP(Sheet3!C13,Sheet2!B3:J3003,9,FALSE)","v":0.21393986645229501}]
[null,11,{"$f":"B14*Sheet1!$C$11","v":22},{"$f":"VLOOKUP(Sheet3!C14,Sheet2!B3:J3003,2,FALSE)","v":44.1},{"$f":"VLOOKUP(Sheet3!C14,Sheet2!B3:J3003,3,FALSE)","v":22.524073126478882},{"$f":"VLOOKUP(Sheet3!C14,Sheet2!B3:J3003,4,FALSE)","v":0.96714888000530774},{"$f":"VLOOKUP(Sheet3!C14,Sheet2!B3:J3003,5,FALSE)","v":6714.3916397625444},{"$f":"VLOOKUP(Sheet3!C14,Sheet2!B3:J3003,6,FALSE)","v":4.0328511199946924},{"$f":"VLOOKUP(Sheet3!C14,Sheet2!B3:J3003,7,FALSE)","v":296.91082238579821},{"$f":"VLOOKUP(Sheet3!C14,Sheet2!B3:J3003,8,FALSE)","v":7.0600155929257349E-2},{"$f":"VLOOKUP(Sheet3!C14,Sheet2!B3:J3003,9,FALSE)","v":0.2353338530975245}]
[null,12,{"$f":"B15*Sheet1!$C$11","v":24},{"$f":"VLOOKUP(Sheet3!C15,Sheet2!B3:J3003,2,FALSE)","v":48.1},{"$f":"VLOOKUP(Sheet3!C15,Sheet2!B3:J3003,3,FALSE)","v":24.900646480550609},{"$f":"VLOOKUP(Sheet3!C15,Sheet2!B3:J3003,4,FALSE)","v":1.0703920271474598},{"$f":"VLOOKUP(Sheet3!C15,Sheet2!B3:J3003,5,FALSE)","v":7431.1529764765319},{"$f":"VLOOKUP(Sheet3!C15,Sheet2!B3:J3003,6,FALSE)","v":3.9296079728525402},{"$f":"VLOOKUP(Sheet3!C15,Sheet2!B3:J3003,7,FALSE)","v":297.2431577268668},{"$f":"VLOOKUP(Sheet3!C15,Sheet2!B3:J3003,8,FALSE)","v":7.7018351922826203E-2},{"$f":"VLOOKUP(Sheet3!C15,Sheet2!B3:J3003,9,FALSE)","v":0.25672783974275404}]
[null,13,{"$f":"B16*Sheet1!$C$11","v":26},{"$f":"VLOOKUP(Sheet3!C16,Sheet2!B3:J3003,2,FALSE)","v":52.1},{"$f":"VLOOKUP(Sheet3!C16,Sheet2!B3:J3003,3,FALSE)","v":27.243517860104372},{"$f":"VLOOKUP(Sheet3!C16,Sheet2!B3:J3003,4,FALSE)","v":1.1724375904063826},{"$f":"VLOOKUP(Sheet3!C16,Sheet2!B3:J3003,5,FALSE)","v":8139.6001359426218},{"$f":"VLOOKUP(Sheet3!C16,Sheet2!B3:J3003,6,FALSE)","v":3.8275624095936172},{"$f":"VLOOKUP(Sheet3!C16,Sheet2!B3:J3003,7,FALSE)","v":297.58166664717925},{"$f":"VLOOKUP(Sheet3!C16,Sheet2!B3:J3003,8,FALSE)","v":8.3436547916395057E-2},{"$f":"VLOOKUP(Sheet3!C16,Sheet2!B3:J3003,9,FALSE)","v":0.2781218263879835}]
[null,14,{"$f":"B17*Sheet1!$C$11","v":28},{"$f":"VLOOKUP(Sheet3!C17,Sheet2!B3:J3003,2,FALSE)","v":56.1},{"$f":"VLOOKUP(Sheet3!C17,Sheet2!B3:J3003,3,FALSE)","v":29.546379011836834},{"$f":"VLOOKUP(Sheet3!C17,Sheet2!B3:J3003,4,FALSE)","v":1.2730182709132905},{"$f":"VLOOKUP(Sheet3!C17,Sheet2!B3:J3003,5,FALSE)","v":8837.8774066700644},{"$f":"VLOOKUP(Sheet3!C17,Sheet2!B3:J3003,6,FALSE)","v":3.7269817290867095},{"$f":"VLOOKUP(Sheet3!C17,Sheet2!B3:J3003,7,FALSE)","v":297.92709069983522},{"$f":"VLOOKUP(Sheet3!C17,Sheet2!B3:J3003,8,FALSE)","v":8.9854743909963897E-2},{"$f":"VLOOKUP(Sheet3!C17,Sheet2!B3:J3003,9,FALSE)","v":0.29951581303321301}]
[null,15,{"$f":"B18*Sheet1!$C$11","v":30},{"$f":"VLOOKUP(Sheet3!C18,Sheet2!B3:J3003,2,FALSE)","v":60.1},{"$f":"VLOOKUP(Sheet3!C18,Sheet2!B3:J3003,3,FALSE)","v":31.804260299882426},{"$f":"VLOOKUP(Sheet3!C18,Sheet2!B3:J3003,4,FALSE)","v":1.3719234908772693},{"$f":"VLOOKUP(Sheet3!C18,Sheet2!B3:J3003,5,FALSE)","v":9524.5228609370133},{"$f":"VLOOKUP(Sheet3!C18,Sheet2!B3:J3003,6,FALSE)","v":3.6280765091227307},{"$f":"VLOOKUP(Sheet3!C18,Sheet2!B3:J3003,7,FALSE)","v":298.28005635940576},{"$f":"VLOOKUP(Sheet3!C18,Sheet2!B3:J3003,8,FALSE)","v":9.627293990353275E-2},{"$f":"VLOOKUP(Sheet3!C18,Sheet2!B3:J3003,9,FALSE)","v":0.32090979967844252}]
[null,16,{"$f":"B19*Sheet1!$C$11","v":32},{"$f":"VLOOKUP(Sheet3!C19,Sheet2!B3:J3003,2,FALSE)","v":64.099999999999994},{"$f":"VLOOKUP(Sheet3!C19,Sheet2!B3:J3003,3,FALSE)","v":34.013300385320953},{"$f":"VLOOKUP(Sheet3!C19,Sheet2!B3:J3003,4,FALSE)","v":1.4689896342423787},{"$f":"VLOOKUP(Sheet3!C19,Sheet2!B3:J3003,5,FALSE)","v":10198.400600950636},{"$f":"VLOOKUP(Sheet3!C19,Sheet2!B3:J3003,6,FALSE)","v":3.5310103657576213},{"$f":"VLOOKUP(Sheet3!C19,Sheet2!B3:J3003,7,FALSE)","v":298.64110238602325},{"$f":"VLOOKUP(Sheet3!C19,Sheet2!B3:J3003,8,FALSE)","v":0.1026911358971016},{"$f":"VLOOKUP(Sheet3!C19,Sheet2!B3:J3003,9,FALSE)","v":0.34230378632367203}]
[null,17,{"$f":"B20*Sheet1!$C$11","v":34},{"$f":"VLOOKUP(Sheet3!C20,Sheet2!B3:J3003,2,FALSE)","v":68.099999999999994},{"$f":"VLOOKUP(Sheet3!C20,Sheet2!B3:J3003,3,FALSE)","v":36.170559810694492},{"$f":"VLOOKUP(Sheet3!C20,Sheet2!B3:J3003,4,FALSE)","v":1.5640921477265031},{"$f":"VLOOKUP(Sheet3!C20,Sheet2!B3:J3003,5,FALSE)","v":10858.645920631619},{"$f":"VLOOKUP(Sheet3!C20,Sheet2!B3:J3003,6,FALSE)","v":3.4359078522734969},{"$f":"VLOOKUP(Sheet3!C20,Sheet2!B3:J3003,7,FALSE)","v":299.01069930085669},{"$f":"VLOOKUP(Sheet3!C20,Sheet2!B3:J3003,8,FALSE)","v":0.10910933189067044},{"$f":"VLOOKUP(Sheet3!C20,Sheet2!B3:J3003,9,FALSE)","v":0.36369777296890149}]
[null,18,{"$f":"B21*Sheet1!$C$11","v":36},{"$f":"VLOOKUP(Sheet3!C21,Sheet2!B3:J3003,2,FALSE)","v":72.099999999999994},{"$f":"VLOOKUP(Sheet3!C21,Sheet2!B3:J3003,3,FALSE)","v":38.273868075643122},{"$f":"VLOOKUP(Sheet3!C21,Sheet2!B3:J3003,4,FALSE)","v":1.6571390609754089},{"$f":"VLOOKUP(Sheet3!C21,Sheet2!B3:J3003,5,FALSE)","v":11504.620319548087},{"$f":"VLOOKUP(Sheet3!C21,Sheet2!B3:J3003,6,FALSE)","v":3.3428609390245909},{"$f":"VLOOKUP(Sheet3!C21,Sheet2!B3:J3003,7,FALSE)","v":299.38926361417185},{"$f":"VLOOKUP(Sheet3!C21,Sheet2!B3:J3003,8,FALSE)","v":0.1155275278842393},{"$f":"VLOOKUP(Sheet3!C21,Sheet2!B3:J3003,9,FALSE)","v":0.385091759614131}]
[null,19,{"$f":"B22*Sheet1!$C$11","v":38},{"$f":"VLOOKUP(Sheet3!C22,Sheet2!B3:J3003,2,FALSE)","v":76.099999999999994},{"$f":"VLOOKUP(Sheet3!C22,Sheet2!B3:J3003,3,FALSE)","v":40.321696893990591},{"$f":"VLOOKUP(Sheet3!C22,Sheet2!B3:J3003,4,FALSE)","v":1.7480656161002717},{"$f":"VLOOKUP(Sheet3!C22,Sheet2!B3:J3003,5,FALSE)","v":12135.874218698998},{"$f":"VLOOKUP(Sheet3!C22,Sheet2!B3:J3003,6,FALSE)","v":3.2519343838997283},{"$f":"VLOOKUP(Sheet3!C22,Sheet2!B3:J3003,7,FALSE)","v":299.77716845571649},{"$f":"VLOOKUP(Sheet3!C22,Sheet2!B3:J3003,8,FALSE)","v":0.12194572387780815},{"$f":"VLOOKUP(Sheet3!C22,Sheet2!B3:J3003,9,FALSE)","v":0.40648574625936051}]
[null,20,{"$f":"B23*Sheet1!$C$11","v":40},{"$f":"VLOOKUP(Sheet3!C23,Sheet2!B3:J3003,2,FALSE)","v":80.099999999999994},{"$f":"VLOOKUP(Sheet3!C23,Sheet2!B3:J3003,3,FALSE)","v":42.313054329876351},{"$f":"VLOOKUP(Sheet3!C23,Sheet2!B3:J3003,4,FALSE)","v":1.8368297819205599},{"$f":"VLOOKUP(Sheet3!C23,Sheet2!B3:J3003,5,FALSE)","v":12752.115818328384},{"$f":"VLOOKUP(Sheet3!C23,Sheet2!B3:J3003,6,FALSE)","v":3.1631702180794403},{"$f":"VLOOKUP(Sheet3!C23,Sheet2!B3:J3003,7,FALSE)","v":300.17475167364984},{"$f":"VLOOKUP(Sheet3!C23,Sheet2!B3:J3003,8,FALSE)","v":0.12836391987137699},{"$f":"VLOOKUP(Sheet3!C23,Sheet2!B3:J3003,9,FALSE)","v":0.42787973290459003}]
[null,21,{"$f":"B24*Sheet1!$C$11","v":42},{"$f":"VLOOKUP(Sheet3!C24,Sheet2!B3:J3003,2,FALSE)","v":84.1},{"$f":"VLOOKUP(Sheet3!C24,Sheet2!B3:J3003,3,FALSE)","v":44.247395854227491},{"$f":"VLOOKUP(Sheet3!C24,Sheet2!B3:J3003,4,FALSE)","v":1.9234084851704722},{"$f":"VLOOKUP(Sheet3!C24,Sheet2!B3:J3003,5,FALSE)","v":13353.184933229808},{"$f":"VLOOKUP(Sheet3!C24,Sheet2!B3:J3003,6,FALSE)","v":3.076591514829528},{"$f":"VLOOKUP(Sheet3!C24,Sheet2!B3:J3003,7,FALSE)","v":300.5823221116429},{"$f":"VLOOKUP(Sheet3!C24,Sheet2!B3:J3003,8,FALSE)","v":0.13478211586494585},{"$f":"VLOOKUP(Sheet3!C24,Sheet2!B3:J3003,9,FALSE)","v":0.44927371954981954}]
[null,22,{"$f":"B25*Sheet1!$C$11","v":44},{"$f":"VLOOKUP(Sheet3!C25,Sheet2!B3:J3003,2,FALSE)","v":88.1},{"$f":"VLOOKUP(Sheet3!C25,Sheet2!B3:J3003,3,FALSE)","v":46.124549291367863},{"$f":"VLOOKUP(Sheet3!C25,Sheet2!B3:J3003,4,FALSE)","v":2.0077944302705109},{"$f":"VLOOKUP(Sheet3!C25,Sheet2!B3:J3003,5,FALSE)","v":13939.030914140265},{"$f":"VLOOKUP(Sheet3!C25,Sheet2!B3:J3003,6,FALSE)","v":2.9922055697294891},{"$f":"VLOOKUP(Sheet3!C25,Sheet2!B3:J3003,7,FALSE)","v":301.00016454866045},{"$f":"VLOOKUP(Sheet3!C25,Sheet2!B3:J3003,8,FALSE)","v":0.1412003118585147},{"$f":"VLOOKUP(Sheet3!C25,Sheet2!B3:J3003,9,FALSE)","v":0.470667706195049}]
[null,23,{"$f":"B26*Sheet1!$C$11","v":46},{"$f":"VLOOKUP(Sheet3!C26,Sheet2!B3:J3003,2,FALSE)","v":92.1},{"$f":"VLOOKUP(Sheet3!C26,Sheet2!B3:J3003,3,FALSE)","v":47.944651286151107},{"$f":"VLOOKUP(Sheet3!C26,Sheet2!B3:J3003,4,FALSE)","v":2.0899934072568467},{"$f":"VLOOKUP(Sheet3!C26,Sheet2!B3:J3003,5,FALSE)","v":14509.693958149641},{"$f":"VLOOKUP(Sheet3!C26,Sheet2!B3:J3003,6,FALSE)","v":2.9100065927431533},{"$f":"VLOOKUP(Sheet3!C26,Sheet2!B3:J3003,7,FALSE)","v":301.42854363973845},{"$f":"VLOOKUP(Sheet3!C26,Sheet2!B3:J3003,8,FALSE)","v":0.14761850785208355},{"$f":"VLOOKUP(Sheet3!C26,Sheet2!B3:J3003,9,FALSE)","v":0.49206169284027851}]
[null,24,{"$f":"B27*Sheet1!$C$11","v":48},{"$f":"VLOOKUP(Sheet3!C27,Sheet2!B3:J3003,2,FALSE)","v":96.1},{"$f":"VLOOKUP(Sheet3!C27,Sheet2!B3:J3003,3,FALSE)","v":49.708093404705167},{"$f":"VLOOKUP(Sheet3!C27,Sheet2!B3:J3003,4,FALSE)","v":2.1700220079145627},{"$f":"VLOOKUP(Sheet3!C27,Sheet2!B3:J3003,5,FALSE)","v":15065.289253048926},{"$f":"VLOOKUP(Sheet3!C27,Sheet2!B3:J3003,6,FALSE)","v":2.8299779920854373},{"$f":"VLOOKUP(Sheet3!C27,Sheet2!B3:J3003,7,FALSE)","v":301.86770709872525},{"$f":"VLOOKUP(Sheet3!C27,Sheet2!B3:J3003,8,FALSE)","v":0.15403670384565241},{"$f":"VLOOKUP(Sheet3!C27,Sheet2!B3:J3003,9,FALSE)","v":0.51345567948550808}]
[null,25,{"$f":"B28*Sheet1!$C$11","v":50},{"$f":"VLOOKUP(Sheet3!C28,Sheet2!B3:J3003,2,FALSE)","v":100.1},{"$f":"VLOOKUP(Sheet3!C28,Sheet2!B3:J3003,3,FALSE)","v":51.415476343252969},{"$f":"VLOOKUP(Sheet3!C28,Sheet2!B3:J3003,4,FALSE)","v":2.2479056854734432},{"$f":"VLOOKUP(Sheet3!C28,Sheet2!B3:J3003,5,FALSE)","v":15605.99350684741},{"$f":"VLOOKUP(Sheet3!C28,Sheet2!B3:J3003,6,FALSE)","v":2.7520943145265568},{"$f":"VLOOKUP(Sheet3!C28,Sheet2!B3:J3003,7,FALSE)","v":302.31788829768396},{"$f":"VLOOKUP(Sheet3!C28,Sheet2!B3:J3003,8,FALSE)","v":0.16045489983922126},{"$f":"VLOOKUP(Sheet3!C28,Sheet2!B3:J3003,9,FALSE)","v":0.53484966613073748}]
[null,26,{"$f":"B29*Sheet1!$C$11","v":52},{"$f":"VLOOKUP(Sheet3!C29,Sheet2!B3:J3003,2,FALSE)","v":104.1},{"$f":"VLOOKUP(Sheet3!C29,Sheet2!B3:J3003,3,FALSE)","v":53.067570995982202},{"$f":"VLOOKUP(Sheet3!C29,Sheet2!B3:J3003,4,FALSE)","v":2.3236771049414413},{"$f":"VLOOKUP(Sheet3!C29,Sheet2!B3:J3003,5,FALSE)","v":16132.033495030073},{"$f":"VLOOKUP(Sheet3!C29,Sheet2!B3:J3003,6,FALSE)","v":2.6763228950585587},{"$f":"VLOOKUP(Sheet3!C29,Sheet2!B3:J3003,7,FALSE)","v":302.77930841163965},{"$f":"VLOOKUP(Sheet3!C29,Sheet2!B3:J3003,8,FALSE)","v":0.16687309583279011},{"$f":"VLOOKUP(Sheet3!C29,Sheet2!B3:J3003,9,FALSE)","v":0.55624365277596699}]
[null,27,{"$f":"B30*Sheet1!$C$11","v":54},{"$f":"VLOOKUP(Sheet3!C30,Sheet2!B3:J3003,2,FALSE)","v":108.1},{"$f":"VLOOKUP(Sheet3!C30,Sheet2!B3:J3003,3,FALSE)","v":54.665285348636978},{"$f":"VLOOKUP(Sheet3!C30,Sheet2!B3:J3003,4,FALSE)","v":2.3973747402907657},{"$f":"VLOOKUP(Sheet3!C30,Sheet2!B3:J3003,5,FALSE)","v":16643.676321579234},{"$f":"VLOOKUP(Sheet3!C30,Sheet2!B3:J3003,6,FALSE)","v":2.6026252597092343},{"$f":"VLOOKUP(Sheet3!C30,Sheet2!B3:J3003,7,FALSE)","v":303.25217820482709},{"$f":"VLOOKUP(Sheet3!C30,Sheet2!B3:J3003,8,FALSE)","v":0.17329129182635897},{"$f":"VLOOKUP(Sheet3!C30,Sheet2!B3:J3003,9,FALSE)","v":0.5776376394211965}]
{"$rows_left_out":4}
{"sheet":"Sheet4","index":3,"n_rows":0,"n_cols":0,"rows_kept":0,"cut":false,"hidden":false,"merged":[]}